Update CHANGELOG

1 job for frictionless_py_migration in 1 minute and 29 seconds (queued for 3 seconds)
Status Job ID Name Coverage
  Test
failed #6437
Run tests

00:01:29

 
Name Stage Failure
failed
Run tests Test
FAILED tests/test_core.py::test_valid_custom_sum_columns_value_3 - AttributeE...
FAILED tests/test_core.py::test_invalid_nomenclature_actes_value_1 - Attribut...
FAILED tests/test_core.py::test_invalid_nomenclature_actes_value_2 - Attribut...
FAILED tests/test_core.py::test_cohesive_columns_values_3 - AttributeError: m...
FAILED tests/test_core.py::test_cohesive_columns_values_4 - AttributeError: m...
FAILED tests/test_core.py::test_compare_columns_value_3 - AttributeError: mod...
======================== 13 failed, 17 passed in 3.82s =========================
Cleaning up file based variables
ERROR: Job failed: exit code 1