Update version

1 job for frictionless_py_migration in 1 minute and 41 seconds (queued for 4 seconds)
Status Job ID Name Coverage
  Test
failed #6444
Run tests

00:01:41

 
Name Stage Failure
failed
Run tests Test
FAILED tests/test_core.py::test_valid_custom_sum_columns_value_4 - AttributeE...
FAILED tests/test_core.py::test_invalid_nomenclature_actes_value_1 - Attribut...
FAILED tests/test_core.py::test_invalid_nomenclature_actes_value_2 - Attribut...
FAILED tests/test_core.py::test_cohesive_columns_values_3 - AttributeError: m...
FAILED tests/test_core.py::test_cohesive_columns_values_4 - AttributeError: m...
FAILED tests/test_core.py::test_compare_columns_value_3 - AttributeError: mod...
======================== 13 failed, 19 passed in 3.85s =========================
Cleaning up file based variables
ERROR: Job failed: exit code 1